BDBM294283 US9586948, Example 2
SMILES Cn1cc(NC(=O)c2cccc(n2)-n2cccc2)c(n1)C(N)=O
InChI Key InChIKey=RSFNLGZFWLZMBQ-UHFFFAOYSA-N
Data  3 IC50
  Tab Delimited (TSV)   2D SDfile   Computed 3D by Vconf -m prep SDfile
Find this compound or compounds like it in BindingDB:
Activity Spreadsheet -- Enzyme Inhibition Constant Data from BindingDB
Found 3 hits for monomerid = 294283
TargetInterleukin-1 receptor-associated kinase 4(Homo sapiens (Human))
Merck Sharp & Dohme
US Patent
LigandPNGBDBM294283(US9586948, Example 2)
Affinity DataIC50:  649nMpH: 7.2Assay Description:The kinase activity of IRAK4 is determined by its ability to catalyze the phosphorylation of a fluorescent polypeptide substrate. The extent of phosp...
In DepthDetails US Patent
TargetInterleukin-1 receptor-associated kinase 4(Homo sapiens (Human))
Merck Sharp & Dohme
US Patent
LigandPNGBDBM294283(US9586948, Example 2)
Affinity DataIC50:  653nM. Assay description: Inhibition of human recombinant N-terminal GST-tagged full-length IRAK4 expressed in baculovirus infected Sf9 insect cells using 5FAM-RKRQGSVRRRVH-CO...
In DepthDetails ArticlePubMed
TargetInterleukin-1 receptor-associated kinase 4(Homo sapiens (Human))
Merck Sharp & Dohme
US Patent
LigandPNGBDBM294283(US9586948, Example 2)
Affinity DataIC50:  653nM. Assay description: Inhibition of human recombinant N-terminal GST-tagged full-length IRAK4 expressed in baculovirus infected Sf9 insect cells using 5FAM-RKRQGSVRRRVH-CO...
In DepthDetails ArticlePubMed