BDBM295965 1-[3-methoxy-4- (1H-pyrazol-4- yl)benzoyl]-3- phenylpiperidine::US10112939, Example 7
SMILES COc1cc(ccc1-c1cn[nH]c1)C(=O)N1CCCC(C1)c1ccccc1
InChI Key
Data  1 IC50
  Tab Delimited (TSV)   2D SDfile   Computed 3D by Vconf -m prep SDfile
Find this compound or compounds like it in BindingDB:
Activity Spreadsheet -- Enzyme Inhibition Constant Data from BindingDB
Found 1 hit for monomerid = 295965
TargetRho-associated protein kinase 2(Homo sapiens (Human))
Bristol-Myers Squibb
US Patent
LigandPNGBDBM295965(1-[3-methoxy-4- (1H-pyrazol-4- yl)benzoyl]-3- phen...)
Affinity DataIC50:  1.43E+3nMpH: 7.5Assay Description:The effectiveness of compounds of the present invention as ROCK inhibitors can be determined in a 30 μL assay containing 20 mM HEPES, pH 7.5, 20...
Ligand InfoPC cidPC sid
In DepthDetails US Patent