BDBM297 (2R,3R)-1,1-dioxo-2-(propan-2-yl)--thiolan-3-yl N-[(2S,3R)-4-[(2S)-2-(tert-butylcarbamoyl)-4-cyclohexylpiperazin-1-yl]-3-hydroxy-1-phenylbutan-2-yl]carbamate::1-(2OHPr)-4-Substit-piperazine, thienyl carbamate deriv. 8
SMILES CC(C)[C@@H]1[C@@H](CCS1(=O)=O)OC(=O)N[C@@H](Cc1ccccc1)[C@H](O)CN1CCN(C[C@H]1C(=O)NC(C)(C)C)C1CCCCC1
InChI Key InChIKey=ORYDIKCVEIVVEP-ATAZIPLOSA-N
Data  3 IC50
  Tab Delimited (TSV)   2D SDfile   Computed 3D by Vconf -m prep SDfile
Find this compound or compounds like it in BindingDB:
Activity Spreadsheet -- Enzyme Inhibition Constant Data from BindingDB
Found 3 hits for monomerid = 297
TargetDimer of Gag-Pol polyprotein [489-587](Human immunodeficiency virus type 1)
Merck Research Laboratories
LigandPNGBDBM297((2R,3R)-1,1-dioxo-2-(propan-2-yl)--thiolan-3-yl N-...)
Affinity DataIC50:  75.3nMpH: 5.2 T: 2°C. Assay description: Sensitivity of HIV-1 protease activity to protease inhibitors was determined by a peptide substrate cleavage assay. Protease products were analyzed o...
In DepthDetails Article
TargetGag-Pol polyprotein [489-587](Human immunodeficiency virus type 1)
Merck Research Laboratories
LigandPNGBDBM297((2R,3R)-1,1-dioxo-2-(propan-2-yl)--thiolan-3-yl N-...)
Affinity DataIC50:  13nM. Assay description: Tested in vitro for the ability to inhibit HIV-1 protease at pH 7.4
In DepthDetails Article
TargetDimer of Gag-Pol polyprotein [489-587](Human immunodeficiency virus type 1)
Merck Research Laboratories
LigandPNGBDBM297((2R,3R)-1,1-dioxo-2-(propan-2-yl)--thiolan-3-yl N-...)
Affinity DataIC50:  13.4nM. Assay description: Sensitivity of HIV-1 protease activity to protease inhibitors was determined by a peptide substrate cleavage assay. Protease products were analyzed o...
In DepthDetails Article