BDBM299330 US9593129, Example 7
SMILES CC[C@@H](CO)N1[C@@H]([C@H](C[C@H](CC(O)=O)C1=O)c1cccc(Cl)c1)c1ccc(Cl)cc1
InChI Key InChIKey=MUYVUHCWOCMQPD-CJXUKZFBSA-N
Data  1 IC50
PDB links: 1 PDB ID matches this monomer.
  Tab Delimited (TSV)   2D SDfile   Computed 3D by Vconf -m prep SDfile
Find this compound or compounds like it in BindingDB:
Activity Spreadsheet -- Enzyme Inhibition Constant Data from BindingDB
Found 1 hit for monomerid = 299330
TargetE3 ubiquitin-protein ligase Mdm2 [1-188](Homo sapiens (Human))
Amgen
US Patent
LigandPNGBDBM299330(US9593129, Example 7)
Affinity DataIC50:  50nM. Assay description: The standard assay conditions for the in vitro HTRF assay consisted of a 50 ul total reaction volume in black 384-well Costar polypropylene plates in...
Ligand InfoPC cidPC sidPDB