BDBM299351 US9592235, Example 160::US9855269, Compound 3::tert-butyl N-[4- (4-amino- quinazolin- 6-yl)phenyl] carbamate
SMILES CC(C)(C)OC(=O)Nc1ccc(cc1)-c1ccc2ncnc(N)c2c1
InChI Key InChIKey=WJPXTPBTIUMFLR-UHFFFAOYSA-N
Data  2 IC50
  Tab Delimited (TSV)   2D SDfile   Computed 3D by Vconf -m prep SDfile
Find this compound or compounds like it in BindingDB:
Activity Spreadsheet -- Enzyme Inhibition Constant Data from BindingDB
Found 2 hits for monomerid = 299351
TargetMitogen-activated protein kinase kinase kinase kinase 4(Homo sapiens (Human))
Genentech
US Patent
LigandPNGBDBM299351(US9592235, Example 160 | US9855269, Compound 3 | t...)
Affinity DataIC50:  503nM. Assay description: The kinase activity of purified human MAP4K4 kinase domain was measured by monitoring the phosphorylation of a peptide substrate derived from moesin ...
Ligand InfoPC cidPC sid
In DepthDetails US Patent
TargetMitogen-activated protein kinase kinase kinase kinase 4(Homo sapiens (Human))
Genentech
US Patent
LigandPNGBDBM299351(US9592235, Example 160 | US9855269, Compound 3 | t...)
Affinity DataIC50:  503nM. Assay description: The kinase activity of purified human MAP4K4 kinase domain was measured by monitoring the phosphorylation of a peptide substrate derived from moesin ...
Ligand InfoPC cidPC sid
In DepthDetails US Patent