BDBM301 (2R,3R)-1,1-dioxo-2-(propan-2-yl)--thiolan-3-yl N-[(2S,3R)-4-[(2S)-2-(tert-butylcarbamoyl)-4-(oxan-4-yl)piperazin-1-yl]-3-hydroxy-1-phenylbutan-2-yl]carbamate::1-(2OHPr)-4-Substit-piperazine, thienyl carbamate deriv. 12
SMILES CC(C)[C@@H]1[C@@H](CCS1(=O)=O)OC(=O)N[C@@H](Cc1ccccc1)[C@H](O)CN1CCN(C[C@H]1C(=O)NC(C)(C)C)C1CCOCC1
InChI Key InChIKey=CDPHXFOTSPZQDA-MUPNWXRXSA-N
Data  2 IC50
  Tab Delimited (TSV)   2D SDfile   Computed 3D by Vconf -m prep SDfile
Find this compound or compounds like it in BindingDB:
Activity Spreadsheet -- Enzyme Inhibition Constant Data from BindingDB
Found 2 hits for monomerid = 301
TargetGag-Pol polyprotein [489-587](Human immunodeficiency virus type 1)
Merck Research Laboratories
LigandPNGBDBM301((2R,3R)-1,1-dioxo-2-(propan-2-yl)--thiolan-3-yl N-...)
Affinity DataIC50:  35nM. Assay description: Tested in vitro for the ability to inhibit HIV-1 protease
In DepthDetails Article
TargetDimer of Gag-Pol polyprotein [489-587](Human immunodeficiency virus type 1)
Merck Research Laboratories
LigandPNGBDBM301((2R,3R)-1,1-dioxo-2-(propan-2-yl)--thiolan-3-yl N-...)
Affinity DataIC50:  34.6nM. Assay description: Sensitivity of HIV-1 protease activity to protease inhibitors was determined by a peptide substrate cleavage assay. Protease products were analyzed o...
In DepthDetails Article