BDBM304552 (S)-4-(3-(methylsulfonyl)phenyl)-2-phenyl-1-((S)-1-(4-(trifluoromethyl)phenyl)ethyl)piperazine::US10144715, Compound 46-16::US10144715, Compound 46-18
SMILES CC(N1CCN(C[C@@H]1c1ccccc1)c1cccc(c1)S(C)(=O)=O)c1ccc(cc1)C(F)(F)F
InChI Key InChIKey=DJPSHUCKIYCLKV-OPEAARRCSA-N
Data  2 KI
  Tab Delimited (TSV)   2D SDfile   Computed 3D by Vconf -m prep SDfile
Find this compound or compounds like it in BindingDB:
Activity Spreadsheet -- Enzyme Inhibition Constant Data from BindingDB
Found 2 hits for monomerid = 304552
TargetOxysterols receptor LXR-beta(Homo sapiens (Human))
Vitae Pharmaceuticals
US Patent
LigandPNGBDBM304552((S)-4-(3-(methylsulfonyl)phenyl)-2-phenyl-1-((S)-1...)
Affinity DataKi:  35nM. Assay description: Compounds of the invention were assessed in a competition binding assay where different concentrations of compounds were incubated with the LXR ligan...
Ligand InfoPC cidPC sid
In DepthDetails US Patent
TargetOxysterols receptor LXR-beta(Homo sapiens (Human))
Vitae Pharmaceuticals
US Patent
LigandPNGBDBM304552((S)-4-(3-(methylsulfonyl)phenyl)-2-phenyl-1-((S)-1...)
Affinity DataKi:  503nM. Assay description: Compounds of the invention were assessed in a competition binding assay where different concentrations of compounds were incubated with the LXR ligan...
Ligand InfoPC cidPC sid
In DepthDetails US Patent