BDBM309023 US9656955, Example 544::butyl {(3R,4S)-1-[(1-methyl-1H-imidazol-4-yl)sulfonyl]-4-phenylpyrrolidin-3-yl}carbamate
SMILES CCCCOC(=O)N[C@H]1CN(C[C@@H]1c1ccccc1)S(=O)(=O)c1cn(C)cn1
InChI Key InChIKey=KFQRCUASLJIPJF-SJORKVTESA-N
Data  1 KI
  Tab Delimited (TSV)   2D SDfile   Computed 3D by Vconf -m prep SDfile
Find this compound or compounds like it in BindingDB:
Activity Spreadsheet -- Enzyme Inhibition Constant Data from BindingDB
Found 1 hit for monomerid = 309023
LigandPNGBDBM309023(US9656955, Example 544 | butyl {(3R,4S)-1-[(1-meth...)
Affinity DataKi: <1.00E+4nM. Assay description: Radioligand binding assays using recombinant CHO cell membranes expressing human GlyT1: Radioligand binding to human GlyT1c transporter-expressing me...
Ligand InfoPC cidPC sid
In DepthDetails US Patent