BDBM30918 4-(o-anisoylamino)benzoic acid::4-[(2-methoxybenzoyl)amino]benzoic acid::4-[(2-methoxyphenyl)carbonylamino]benzoic acid::4-[[(2-methoxyphenyl)-oxomethyl]amino]benzoic acid::MLS000053035::SMR000068998::cid_785218
SMILES COc1ccccc1C(=O)Nc1ccc(cc1)C(O)=O
InChI Key InChIKey=MBSLIRHDZLWLSE-UHFFFAOYSA-N
Data  1 EC50
  Tab Delimited (TSV)   2D SDfile   Computed 3D by Vconf -m prep SDfile
Find this compound or compounds like it in BindingDB:
Activity Spreadsheet -- Enzyme Inhibition Constant Data from BindingDB
Found 1 hit for monomerid = 30918
Target5-hydroxytryptamine receptor 1A(Homo sapiens (Human))
The Scripps Research Institute Molecular Screening Center
Curated by PubChem BioAssay
LigandPNGBDBM30918(4-(o-anisoylamino)benzoic acid | 4-[(2-methoxybenz...)
Affinity DataEC50:  9.90E+4nMpH: 7.4 T: 2°C. Assay description: A cell line containing the human 5-HT1a receptor, the promiscuous G-alpha-15 protein (Ga15) as well as the beta-lactamase (BLA) reporter-gene under c...
In DepthDetails PCBioAssay