BDBM310095 US10377768, Compound 9::US9657033, Compound 9
SMILES CC(C)(C)c1cccc(c1)S(=O)(=O)n1ncc2cnc(NC(=O)c3c(F)cccc3Cl)cc12
InChI Key InChIKey=VVRBKPLQNZDCLK-UHFFFAOYSA-N
Data  2 EC50
  Tab Delimited (TSV)   2D SDfile   Computed 3D by Vconf -m prep SDfile
Find this compound or compounds like it in BindingDB:
Activity Spreadsheet -- Enzyme Inhibition Constant Data from BindingDB
Found 2 hits for monomerid = 310095
TargetNuclear receptor ROR-gamma(Homo sapiens (Human))
Lycera
US Patent
LigandPNGBDBM310095(US10377768, Compound 9 | US9657033, Compound 9)
Affinity DataEC50:  3.52E+3nM. Assay description: Recombinant, HIS-tagged RORγ-LBD was expressed in SF9 cells using a baculovirus expression system. Cells were lysed and the lysate was used as a...
Ligand InfoPC cidPC sid
In DepthDetails US Patent
TargetNuclear receptor ROR-gamma(Homo sapiens (Human))
Lycera
US Patent
LigandPNGBDBM310095(US10377768, Compound 9 | US9657033, Compound 9)
Affinity DataEC50:  3.52E+3nM. Assay description: Recombinant,HIS-tagged RORγ-LBD was expressed in SF9 cells using a baculovirus expression system. Cells were lysed and the lysate was used as a ...
Ligand InfoPC cidPC sid
In DepthDetails US Patent