BDBM31591 pyrazole, 3
SMILES C(Oc1ccc(cc1)-c1n[nH]cc1-c1ccncc1)c1ccc2ccccc2n1
InChI Key InChIKey=VRWJZGHUCOFGPZ-UHFFFAOYSA-N
Data  1 IC50
PDB links: 1 PDB ID matches this monomer.
  Tab Delimited (TSV)   2D SDfile   Computed 3D by Vconf -m prep SDfile
Find this compound or compounds like it in BindingDB:
Activity Spreadsheet -- Enzyme Inhibition Constant Data from BindingDB
Found 1 hit for monomerid = 31591
LigandPNGBDBM31591(pyrazole, 3)
Affinity DataIC50:  0.420nMpH: 7.5 T: 2°C. Assay description: PDE activity was measured using a plate-based Scintillation Proximity Assay (SPA). For competitive enzyme inhibition assays, the substrate [3H]cAMP c...