BDBM316139 2-methoxyethyl {4-[(6-{[2-(methylcarbamoyl)phenyl]thio}-1H-indazol-3-yl)ethynyl]phenyl}carbamate ::US9617222, Compound 14
SMILES CNC(=O)c1ccccc1Sc1ccc2c(n[nH]c2c1)C#Cc1ccc(NC(=O)OCCOC)cc1
InChI Key InChIKey=DQSHEMOSOBKLFS-UHFFFAOYSA-N
Data  1 IC50
  Tab Delimited (TSV)   2D SDfile   Computed 3D by Vconf -m prep SDfile
Find this compound or compounds like it in BindingDB:
Activity Spreadsheet -- Enzyme Inhibition Constant Data from BindingDB
Found 1 hit for monomerid = 316139
TargetVascular endothelial growth factor receptor 2(Homo sapiens (Human))
Senju Pharmaceutical
US Patent
LigandPNGBDBM316139(2-methoxyethyl {4-[(6-{[2-(methylcarbamoyl)phenyl]...)
Affinity DataIC50:  7.60nM. Assay description: Measurement of the kinase inhibitory activity of each compound produced in Examples was conducted using the Off-chip Mobility Shift Assay. For this t...
Ligand InfoPC cidPC sid
In DepthDetails US Patent