BDBM316198 2-methoxy-5-(6-(2- methoxyphenyl)pyrimidin-4- ylamino)phenyl pivalate::US10294218, Example 26::US9617225, Example 26
SMILES COc1ccc(Nc2cc(ncn2)-c2ccccc2OC)cc1OC(=O)C(C)(C)C
InChI Key InChIKey=JRUORZLMWWONNF-UHFFFAOYSA-N
Data  2 IC50
  Tab Delimited (TSV)   2D SDfile   Computed 3D by Vconf -m prep SDfile
Find this compound or compounds like it in BindingDB:
Activity Spreadsheet -- Enzyme Inhibition Constant Data from BindingDB
Found 2 hits for monomerid = 316198
TargetCyclin-T1/Cyclin-dependent kinase 9(Homo sapiens (Human))
Virostatics
US Patent
LigandPNGBDBM316198(2-methoxy-5-(6-(2- methoxyphenyl)pyrimidin-4- ylam...)
Affinity DataIC50: <1.00E+4nM. Assay description: The activity of the compounds described in the present invention can be determined by measuring the phosphorylation of a fluorescently-labeled peptid...
Ligand InfoPC cidPC sid
In DepthDetails US Patent
TargetCyclin-dependent kinase 9(Homo sapiens (Human))
Virostatics
US Patent
LigandPNGBDBM316198(2-methoxy-5-(6-(2- methoxyphenyl)pyrimidin-4- ylam...)
Affinity DataIC50: <1.00E+4nM. Assay description: The activity of the compounds described in the present invention can be determined by measuring the phosphorylation of a fluorescently-labeled peptid...
Ligand InfoPC cidPC sid
In DepthDetails US Patent