BDBM316853 US9617260, Compound 12::benzyl N-[3- [3-[(4-methyl- 2- oxopentanoyl) amino]phenyl]- 1H- pyrrolo[2,3- b]pyridin-5- yl]carbamate
SMILES CC(C)CC(=O)C(=O)Nc1cccc(c1)-c1c[nH]c2ncc(NC(=O)OCc3ccccc3)cc12
InChI Key InChIKey=DOJGBKBEJOJWQD-UHFFFAOYSA-N
Data  1 IC50
  Tab Delimited (TSV)   2D SDfile   Computed 3D by Vconf -m prep SDfile
Find this compound or compounds like it in BindingDB:
Activity Spreadsheet -- Enzyme Inhibition Constant Data from BindingDB
Found 1 hit for monomerid = 316853
TargetTyrosine-protein kinase BTK(Homo sapiens (Human))
Hoffmann-La Roche
US Patent
LigandPNGBDBM316853(US9617260, Compound 12 | benzyl N-[3- [3-[(4-methy...)
Affinity DataIC50:  285nM. Assay description: This BTK competition assay measures compound potency (IC50) for the inactivated state of Bruton's Tyrosine Kinase using FRET (Förster/Fluoresence...
Ligand InfoPC cidPC sid
In DepthDetails US Patent