BDBM318988 US10173991, Example 29::methyl N-{4-[2- ({[(cyclopropyl- carbamoyl)methyl] carbamoyl} (methanesulfonyl) methyl)-1,3- benzothiazol-6-yl]- 3-methylphenyl} carbamate
SMILES Cc1cc(NC(=O)CO)ccc1-c1ccc2nc(sc2c1)C(C(=O)NCC(=O)NC1CC1)S(C)(=O)=O
InChI Key InChIKey=IFAFWNKAUGRPBL-UHFFFAOYSA-N
Data  1 IC50
  Tab Delimited (TSV)   2D SDfile   Computed 3D by Vconf -m prep SDfile
Find this compound or compounds like it in BindingDB:
Activity Spreadsheet -- Enzyme Inhibition Constant Data from BindingDB
Found 1 hit for monomerid = 318988
TargetEndothelial lipase(Homo sapiens (Human))
Bristol-Myers Squibb
US Patent
LigandPNGBDBM318988(US10173991, Example 29 | methyl N-{4-[2- ({[(cyclo...)
Affinity DataIC50:  20nM. Assay description: Endothelial lipase (EL) and hepatic lipase (HL) activities were measured using a fluorescent substrate, A10070, (Invitrogen, CA) doped into an artifi...
Ligand InfoPC cidPC sid
In DepthDetails US Patent