BDBM319080 US10173991, Example 123::methyl N-{3-[2- ({[(cyclopropyl- carbamoyl)methyl] carbamoyl} (methanesulfonyl) methyl)-6-fluoro- 1,3-benzothiazol- 5-yl]phenyl} carbamate
SMILES COC(=O)Nc1cccc(c1)-c1cc2nc(sc2cc1F)C(C(=O)NCC(=O)NC1CC1)S(C)(=O)=O
InChI Key InChIKey=GYKZOZYAELYRIK-UHFFFAOYSA-N
Data  1 IC50
  Tab Delimited (TSV)   2D SDfile   Computed 3D by Vconf -m prep SDfile
Find this compound or compounds like it in BindingDB:
Activity Spreadsheet -- Enzyme Inhibition Constant Data from BindingDB
Found 1 hit for monomerid = 319080
TargetEndothelial lipase(Homo sapiens (Human))
Bristol-Myers Squibb
US Patent
LigandPNGBDBM319080(US10173991, Example 123 | methyl N-{3-[2- ({[(cycl...)
Affinity DataIC50:  5nM. Assay description: Endothelial lipase (EL) and hepatic lipase (HL) activities were measured using a fluorescent substrate, A10070, (Invitrogen, CA) doped into an artifi...
Ligand InfoPC cidPC sid
In DepthDetails US Patent