BDBM32254 2-keto-6-methyl-1H-quinoline-4-carboxylic acid methyl ester::6-methyl-2-oxo-1H-quinoline-4-carboxylic acid methyl ester::BAS_03230944::cid_884146::methyl 6-methyl-2-oxidanylidene-1H-quinoline-4-carboxylate::methyl 6-methyl-2-oxo-1H-quinoline-4-carboxylate
SMILES COC(=O)c1cc(=O)[nH]c2ccc(C)cc12
InChI Key InChIKey=FXUKMRNPWWIZRT-UHFFFAOYSA-N
Data  1 IC50
  Tab Delimited (TSV)   2D SDfile   Computed 3D by Vconf -m prep SDfile
Find this compound or compounds like it in BindingDB:
Activity Spreadsheet -- Enzyme Inhibition Constant Data from BindingDB
Found 1 hit for monomerid = 32254
TargetHeat shock protein HSP 90-alpha(Homo sapiens (Human))
Emory University
Curated by PubChem BioAssay
LigandPNGBDBM32254(2-keto-6-methyl-1H-quinoline-4-carboxylic acid met...)
Affinity DataIC50:  5.00E+4nMpH: 7.4 T: 2°C. Assay description: A fluorescence polarization based HTS assay has been developed and optimized for the identification of Hsp90 inhibitors by using tumor cell lysate Hs...
In DepthDetails PCBioAssay