BDBM3251 (1S,2S)-2-[(4-hydroxybenzene)amido]cyclopentyl 3,5-dihydroxy-4-[2-hydroxy-6-(methoxycarbonyl)phenoxy]benzoate::Balanol Benzophenone Ester Analog (+)8
SMILES COC(=O)c1cccc(O)c1Oc1c(O)cc(cc1O)C(=O)O[C@H]1CCC[C@@H]1NC(=O)c1ccc(O)cc1
InChI Key InChIKey=YRTMRGPNXUUDTD-AVRDEDQJSA-N
Data  5 IC50
  Tab Delimited (TSV)   2D SDfile   Computed 3D by Vconf -m prep SDfile
Find this compound or compounds like it in BindingDB:
Activity Spreadsheet -- Enzyme Inhibition Constant Data from BindingDB
Found 5 hits for monomerid = 3251
TargetProtein kinase C alpha type(Homo sapiens (Human))
Sphinx Pharmaceuticals
LigandPNGBDBM3251((1S,2S)-2-[(4-hydroxybenzene)amido]cyclopentyl 3,5...)
Affinity DataIC50:  4.20E+3nM. Assay description: The activity of PKC, activated by phosphatidylerine and Ca2+, is measured by its ability to transfer phosphate from [gamma-32P]ATP to lysine-rich his...
In DepthDetails Article
TargetProtein kinase C beta type(Homo sapiens (Human))
Sphinx Pharmaceuticals
LigandPNGBDBM3251((1S,2S)-2-[(4-hydroxybenzene)amido]cyclopentyl 3,5...)
Affinity DataIC50:  1.80E+3nM. Assay description: The activity of PKC, activated by phosphatidylerine and Ca2+, is measured by its ability to transfer phosphate from [gamma-32P]ATP to lysine-rich his...
In DepthDetails Article
TargetProtein kinase C eta type(Homo sapiens (Human))
Sphinx Pharmaceuticals
LigandPNGBDBM3251((1S,2S)-2-[(4-hydroxybenzene)amido]cyclopentyl 3,5...)
Affinity DataIC50:  400nM. Assay description: The activity of PKC, activated by phosphatidylerine and Ca2+, is measured by its ability to transfer phosphate from [gamma-32P]ATP to lysine-rich his...
In DepthDetails Article
TargetProtein kinase C epsilon type(Homo sapiens (Human))
Sphinx Pharmaceuticals
LigandPNGBDBM3251((1S,2S)-2-[(4-hydroxybenzene)amido]cyclopentyl 3,5...)
Affinity DataIC50:  2.00E+4nM. Assay description: The activity of PKC, activated by phosphatidylerine and Ca2+, is measured by its ability to transfer phosphate from [gamma-32P]ATP to lysine-rich his...
In DepthDetails Article
TargetProtein kinase C delta type(Homo sapiens (Human))
Sphinx Pharmaceuticals
LigandPNGBDBM3251((1S,2S)-2-[(4-hydroxybenzene)amido]cyclopentyl 3,5...)
Affinity DataIC50:  250nM. Assay description: The activity of PKC, activated by phosphatidylerine and Ca2+, is measured by its ability to transfer phosphate from [gamma-32P]ATP to lysine-rich his...
In DepthDetails Article