BDBM325737 (rac)-Ethyl 2-[4-[3-fluoro-4-(trifluoromethyl)phenyl]-6,7-dihydro-5H-cyclopenta[c]pyridin-5-yl]acetate::US9636338, 11
SMILES CCOC(=O)CC1CCc2cncc(c12)-c1ccc(c(F)c1)C(F)(F)F
InChI Key InChIKey=OQFDAZAKJXDUCB-UHFFFAOYSA-N
Data  2 EC50
  Tab Delimited (TSV)   2D SDfile   Computed 3D by Vconf -m prep SDfile
Find this compound or compounds like it in BindingDB:
Activity Spreadsheet -- Enzyme Inhibition Constant Data from BindingDB
Found 2 hits for monomerid = 325737
TargetCytochrome P450 11B2, mitochondrial(Homo sapiens (Human))
Hoffmann-La Roche
US Patent
LigandPNGBDBM325737((rac)-Ethyl 2-[4-[3-fluoro-4-(trifluoromethyl)phen...)
Affinity DataEC50:  64nM. Assay description: The expression plasmids contains the ORF for either human/cyno CYP11B1 or CYP11B2 under the control of a suitable promoter (CMV-promoter) and a suita...
Ligand InfoPC cidPC sid
In DepthDetails US Patent
TargetCytochrome P450 11B1, mitochondrial(Homo sapiens (Human))
Hoffmann-La Roche
US Patent
LigandPNGBDBM325737((rac)-Ethyl 2-[4-[3-fluoro-4-(trifluoromethyl)phen...)
Affinity DataEC50:  367nM. Assay description: The expression plasmids contains the ORF for either human/cyno CYP11B1 or CYP11B2 under the control of a suitable promoter (CMV-promoter) and a suita...
Ligand InfoPC cidPC sid
In DepthDetails US Patent