BDBM325773 (rac)-Ethyl 2-[4-[2-fluoro-4-(trifluoromethyl)phenyl]-5,6,7,8-tetrahydroisoquinolin-8-yl]acetate::US9636339, 23
SMILES CCOC(=O)CC1CCCc2c1cncc2-c1ccc(cc1F)C(F)(F)F
InChI Key InChIKey=RXPBHOILDHTPIN-UHFFFAOYSA-N
Data  2 EC50
  Tab Delimited (TSV)   2D SDfile   Computed 3D by Vconf -m prep SDfile
Find this compound or compounds like it in BindingDB:
Activity Spreadsheet -- Enzyme Inhibition Constant Data from BindingDB
Found 2 hits for monomerid = 325773
TargetCytochrome P450 11B2, mitochondrial(Homo sapiens (Human))
Hoffmann-La Roche
US Patent
LigandPNGBDBM325773((rac)-Ethyl 2-[4-[2-fluoro-4-(trifluoromethyl)phen...)
Affinity DataEC50:  27nM. Assay description: G-402 cells expressing CYP11 constructs were established as described above and maintained in McCoy's 5a Medium Modified, ATCC Catalog No. 30-200...
Ligand InfoPC cidPC sid
In DepthDetails US Patent
TargetCytochrome P450 11B1, mitochondrial(Homo sapiens (Human))
Hoffmann-La Roche
US Patent
LigandPNGBDBM325773((rac)-Ethyl 2-[4-[2-fluoro-4-(trifluoromethyl)phen...)
Affinity DataEC50:  1.90E+3nM. Assay description: G-402 cells expressing CYP11 constructs were established as described above and maintained in McCoy's 5a Medium Modified, ATCC Catalog No. 30-200...
Ligand InfoPC cidPC sid
In DepthDetails US Patent