BDBM328428 (S)-tert-butyl (2- (acetamidomethyl)-4-((2,3- dichlorophenyl)sulfonyl)-3,4- dihydro-2H-benzo[b][1,4]oxazin- 6-yl)carbamate::US9663502, 5K
SMILES CC(=O)NC[C@H]1CN(c2cc(NC(=O)OC(C)(C)C)ccc2O1)S(=O)(=O)c1cccc(Cl)c1Cl
InChI Key InChIKey=FIGYQEBOPQFKAX-HNNXBMFYSA-N
Data  1 IC50
  Tab Delimited (TSV)   2D SDfile   Computed 3D by Vconf -m prep SDfile
Find this compound or compounds like it in BindingDB:
Activity Spreadsheet -- Enzyme Inhibition Constant Data from BindingDB
Found 1 hit for monomerid = 328428
TargetNuclear receptor ROR-gamma(Homo sapiens (Human))
Lycera
US Patent
LigandPNGBDBM328428((S)-tert-butyl (2- (acetamidomethyl)-4-((2,3- dich...)
Affinity DataIC50:  54.5nM. Assay description: The compounds of the invention inhibit RORgammaT activity. Activation of RORgammaT activity can be measured using, e.g., a biochemical TR-FRET assay....
Ligand InfoPC cidPC sid
In DepthDetails US Patent