BDBM32892 4-[(6-methyl-2-pyridyl)carbamoylamino]benzoic acid ethyl ester::4-[[[(6-methyl-2-pyridinyl)amino]-oxomethyl]amino]benzoic acid ethyl ester::MLS000679527::SMR000297774::cid_6469443::ethyl 4-({[(6-methyl-2-pyridinyl)amino]carbonyl}amino)benzoate::ethyl 4-[(6-methylpyridin-2-yl)carbamoylamino]benzoate
SMILES CCOC(=O)c1ccc(NC(=O)Nc2cccc(C)n2)cc1
InChI Key InChIKey=HOZWSQSZCMVYNO-UHFFFAOYSA-N
Data  1 IC50
  Tab Delimited (TSV)   2D SDfile   Computed 3D by Vconf -m prep SDfile
Find this compound or compounds like it in BindingDB:
Activity Spreadsheet -- Enzyme Inhibition Constant Data from BindingDB
Found 1 hit for monomerid = 32892
TargetCoagulation factor XI(Homo sapiens (Human))
Pcmd
Curated by PubChem BioAssay
LigandPNGBDBM32892(4-[(6-methyl-2-pyridyl)carbamoylamino]benzoic acid...)
Affinity DataIC50: >5.00E+4nMpH: 7.4 T: 2°C. Assay description: Factor XIa (0.23 ug/mL) was incubated with Boc-Glu-Ala-Arg-AMC substrate (15 uM) in 10 uL of assay buffer for 2 hr at room temperature. Read fluoresc...
In DepthDetails PCBioAssay