BDBM332469 4-(1-(2-chloro-6-(trifluoromethyl)benzoyl)-6-(5-methyloxazol-2-yl)-1H-indazol-3-yl)benzoate (9A)::US10196354, Example 9A
SMILES OC(=O)c1ccc2c(I)nn(C(=O)c3c(Cl)cccc3C(F)(F)F)c2c1
InChI Key InChIKey=PAHXSXYLIROUER-UHFFFAOYSA-N
Data  1 IC50
  Tab Delimited (TSV)   2D SDfile   Computed 3D by Vconf -m prep SDfile
Find this compound or compounds like it in BindingDB:
Activity Spreadsheet -- Enzyme Inhibition Constant Data from BindingDB
Found 1 hit for monomerid = 332469
TargetNuclear receptor ROR-gamma(Homo sapiens (Human))
Merck Sharp & Dohme
US Patent
LigandPNGBDBM332469(4-(1-(2-chloro-6-(trifluoromethyl)benzoyl)-6-(5-me...)
Affinity DataIC50:  63nM. Assay description: The compounds of the invention inhibit RORgammaT activity. Activation of RORgammaT activity can be measured using, e.g., biochemical TR-FRET assay. I...
Ligand InfoPC cidPC sid
In DepthDetails US Patent