BDBM33805 (3-nitrophenyl)methyl 3-(propanoylamino)benzoate::3-(1-oxopropylamino)benzoic acid (3-nitrophenyl)methyl ester::3-nitrobenzyl 3-(propionylamino)benzoate::3-propionamidobenzoic acid (3-nitrobenzyl) ester::MLS000662534::SMR000292424::cid_891541
SMILES CCC(=O)Nc1cccc(c1)C(=O)OCc1cccc(c1)[N+]([O-])=O
InChI Key InChIKey=UOJRMGUARHLASY-UHFFFAOYSA-N
Data  2 IC50
  Tab Delimited (TSV)   2D SDfile   Computed 3D by Vconf -m prep SDfile
Find this compound or compounds like it in BindingDB:
Activity Spreadsheet -- Enzyme Inhibition Constant Data from BindingDB
Found 2 hits for monomerid = 33805
TargetKallikrein-5(Homo sapiens (Human))
Pcmd
Curated by PubChem BioAssay
LigandPNGBDBM33805((3-nitrophenyl)methyl 3-(propanoylamino)benzoate |...)
Affinity DataIC50:  5.00E+4nM. Assay description: Molecular Library Screening Center Network (MLSCN) Penn Center for Molecular Discovery (PCMD) Assay Provider: Scott L. Diamond, University of Pennsy...
In DepthDetails PCBioAssay
TargetProthrombin(Homo sapiens (Human))
Pcmd
Curated by PubChem BioAssay
LigandPNGBDBM33805((3-nitrophenyl)methyl 3-(propanoylamino)benzoate |...)
Affinity DataIC50: >5.00E+4nMpH: 7.5 T: 2°C. Assay description: HTS was performed using 217,350 compounds of the MLSCN library individually plated into 10ul 1536 compound plates at a concentration of 2.5 mM each, ...
In DepthDetails PCBioAssay