BDBM34533 2-[(7-hexyl-2,6-diketo-3-methyl-purin-8-yl)thio]acetic acid methyl ester::2-[(7-hexyl-3-methyl-2,6-dioxo-8-purinyl)thio]acetic acid methyl ester::MLS000103153::SMR000015644::cid_3151088::methyl 2-(7-hexyl-3-methyl-2,6-dioxopurin-8-yl)sulfanylacetate::methyl 2-[7-hexyl-3-methyl-2,6-bis(oxidanylidene)purin-8-yl]sulfanylethanoate
SMILES CCCCCCn1c(SCC(=O)OC)nc2n(C)c(=O)[nH]c(=O)c12
InChI Key InChIKey=PGESGLMKPJFZIR-UHFFFAOYSA-N
Data  1 IC50
  Tab Delimited (TSV)   2D SDfile   Computed 3D by Vconf -m prep SDfile
Find this compound or compounds like it in BindingDB:
Activity Spreadsheet -- Enzyme Inhibition Constant Data from BindingDB
Found 1 hit for monomerid = 34533
TargetDNA dC->dU-editing enzyme APOBEC-3G(Homo sapiens (Human))
Burnham Center For Chemical Genomics
Curated by PubChem BioAssay
LigandPNGBDBM34533(2-[(7-hexyl-2,6-diketo-3-methyl-purin-8-yl)thio]ac...)
Affinity DataIC50:  5.16E+4nMT: 2°C. Assay description: Data Source: Sanford-Burnham Center for Chemical Genomics (SBCCG) Source Affiliation: Sanford-Burnham Medical Research Institute (SBMRI, San Diego, C...
In DepthDetails PCBioAssay