BDBM349381 (4R)-4-methyl-6-(1-methyl-::US10206931, Example 189
SMILES C[C@@H]1CC(=O)Nc2cccc(-c3cc4CCCCc4n3C)c2N1
InChI Key InChIKey=AUAXIXGQYOHUHL-GFCCVEGCSA-N
Data  2 IC50
  Tab Delimited (TSV)   2D SDfile   Computed 3D by Vconf -m prep SDfile
Find this compound or compounds like it in BindingDB:
Activity Spreadsheet -- Enzyme Inhibition Constant Data from BindingDB
Found 2 hits for monomerid = 349381
TargetBromodomain-containing protein 4 [42-168](Homo sapiens (Human))
Genentech
US Patent
LigandPNGBDBM349381((4R)-4-methyl-6-(1-methyl- | US10206931, Example 1...)
Affinity DataIC50:  1.78E+4nM. Assay description: His/Flag epitope tagged BRD4 BD142-168 was cloned, expressed, and purified to. BRD4 binding and inhibition was assessed by monitoring the engagement ...
Ligand InfoPC cidPC sid
In DepthDetails US Patent
TargetCREB-binding protein(Homo sapiens (Human))
Genentech
US Patent
LigandPNGBDBM349381((4R)-4-methyl-6-(1-methyl- | US10206931, Example 1...)
Affinity DataIC50:  734nM. Assay description: His/Flag epitope tagged CBP was cloned, expressed, and purified to homogeneity. CBP binding and inhibition was assessed by monitoring the engagement ...
Ligand InfoPC cidPC sid
In DepthDetails US Patent