BDBM352074 US9802907, Febuxostat
SMILES CC(C)Oc1ccc(cc1C#N)-c1nc(C)c(s1)C(O)=O
InChI Key InChIKey=UBKMOFWTLCOKFO-UHFFFAOYSA-N
Data  1 IC50
  Tab Delimited (TSV)   2D SDfile   Computed 3D by Vconf -m prep SDfile
Find this compound or compounds like it in BindingDB:
Activity Spreadsheet -- Enzyme Inhibition Constant Data from BindingDB
Found 1 hit for monomerid = 352074
TargetXanthine dehydrogenase/oxidase(Homo sapiens (Human))
Jiangsu Atom Bioscience And Pharmaceutical
US Patent
LigandPNGBDBM352074(US9802907, Febuxostat)
Affinity DataIC50:  2.78nM. Assay description: The inhibition of the activity of xanthine oxidase (XO) is tested through a coupled enzymatic reaction of xanthine oxidase, horseradish peroxidase (H...
In DepthDetails US Patent