BDBM353801 US9796708, Example 1033::ethyl {4-[4-(5-fluoro-2-methoxyphenyl)-1H-pyrrolo[2,3-b]pyridin-2-yl]-3,6-dihydropyridin-1(2H)-yl}acetate
SMILES CCOC(=O)CN1CCC(=CC1)c1cc2c(ccnc2[nH]1)-c1cc(F)ccc1OC
InChI Key InChIKey=TXJQQSQBJBZBNT-UHFFFAOYSA-N
Data  1 IC50
  Tab Delimited (TSV)   2D SDfile   Computed 3D by Vconf -m prep SDfile
Find this compound or compounds like it in BindingDB:
Activity Spreadsheet -- Enzyme Inhibition Constant Data from BindingDB
Found 1 hit for monomerid = 353801
TargetCyclin-T1/Cyclin-dependent kinase 9(Homo sapiens (Human))
Abbvie
US Patent
LigandPNGBDBM353801(US9796708, Example 1033 | ethyl {4-[4-(5-fluoro-2-...)
Affinity DataIC50:  140nM. Assay description: CDK9 enzyme activities were measured using LANCE ULight TR-FRET kinase assay reagents (PerkinElmer, Waltham, Mass.). Compounds were directly added in...
Ligand InfoPC cidPC sid
In DepthDetails US Patent