BDBM35454 2-cyclopropyl-4-quinolinecarboxylic acid::2-cyclopropylcinchoninic acid::2-cyclopropylquinoline-4-carboxylic acid::CC-PMLSC-DMA-P121::cid_275785
SMILES OC(=O)c1cc(nc2ccccc12)C1CC1
InChI Key InChIKey=HYOFXKNWXLKLSH-UHFFFAOYSA-N
Data  1 IC50  1 EC50
  Tab Delimited (TSV)   2D SDfile   Computed 3D by Vconf -m prep SDfile
Find this compound or compounds like it in BindingDB:
Activity Spreadsheet -- Enzyme Inhibition Constant Data from BindingDB
Found 2 hits for monomerid = 35454
TargetGlycogen synthase kinase-3 beta(Homo sapiens (Human))
Broad Institute
Curated by PubChem BioAssay
LigandPNGBDBM35454(2-cyclopropyl-4-quinolinecarboxylic acid | 2-cyclo...)
Affinity DataEC50: >3.00E+5nM. Assay description: Keywords: GSK3beta, dose response, kinase, inhibition, HTS Assay Overview: The glycogen synthase kinase-3 beta (GSK-3b) is a known master regulator f...
In DepthDetails PCBioAssay
TargetDual specificity protein phosphatase 1(Homo sapiens (Human))
Cc_Pmlsc
Curated by PubChem BioAssay
LigandPNGBDBM35454(2-cyclopropyl-4-quinolinecarboxylic acid | 2-cyclo...)
Affinity DataIC50: >5.00E+4nMpH: 7.0 T: 2°C. Assay description: The MKP-1 dose response assay SAR support Assay - has been developed to test the activity of a series Analog compounds synthesized by the PMLSC Chemi...
In DepthDetails PCBioAssay