BDBM354702 Preparation of t-butyl(4-hydroxybenzyl)carbamate::US9809583, Example 10
SMILES Fc1ccc(OC[C@@H]2CN([C@H](O2)C(F)(F)F)c2ccc(C#N)c(c2)C(F)(F)F)cc1F
InChI Key InChIKey=XMTPUJBKTYLNBK-SUMWQHHRSA-N
Data  1 IC50
  Tab Delimited (TSV)   2D SDfile   Computed 3D by Vconf -m prep SDfile
Find this compound or compounds like it in BindingDB:
Activity Spreadsheet -- Enzyme Inhibition Constant Data from BindingDB
Found 1 hit for monomerid = 354702
TargetAndrogen receptor(Chlorocebus sabaeus (Green monkey) (Cercopithecus ...)
Dong-A St
US Patent
LigandPNGBDBM354702(Preparation of t-butyl(4-hydroxybenzyl)carbamate |...)
Affinity DataIC50:  6.30nM. Assay description: In order to examine binding ability of the agonists of the present invention to androgen receptors, the following in-vitro experiment was performed. ...
Ligand InfoPC cidPC sid
In DepthDetails US Patent