BDBM35772 cis-1,2-diaminocyclohexane derivative, 45c
SMILES CN(C)C(=O)[C@H]1CC[C@H](NC(=O)c2cc3ccc(Cl)cc3cn2)[C@@H](C1)NC(=O)c1nc2CN(C)Cc2s1
InChI Key InChIKey=GZCKMZURFJCTJE-ZYSHUDEJSA-N
Data  1 IC50
PDB links: 1 PDB ID matches this monomer.
  Tab Delimited (TSV)   2D SDfile   Computed 3D by Vconf -m prep SDfile
Find this compound or compounds like it in BindingDB:
Activity Spreadsheet -- Enzyme Inhibition Constant Data from BindingDB
Found 1 hit for monomerid = 35772
TargetCoagulation factor X(Homo sapiens (Human))
Daiichi Sankyo
LigandPNGBDBM35772(cis-1,2-diaminocyclohexane derivative, 45c)
Affinity DataIC50:  9.5nMpH: 7.4 T: 2°C. Assay description: The in vitro anti-fXa activity was measured by using a chromogenic substrate S-2222 and human fXa. Aqueous DMSO or test compounds in aqueous DMSO and...