BDBM35892 flufenamic acid analogue, 19
SMILES Cc1ccc(Oc2ccc(Nc3ccccc3C(O)=O)cc2)cc1
InChI Key InChIKey=TWTQNABSRPZBFE-UHFFFAOYSA-N
Data  1 IC50  1 EC50
  Tab Delimited (TSV)   2D SDfile   Computed 3D by Vconf -m prep SDfile
Find this compound or compounds like it in BindingDB:
Activity Spreadsheet -- Enzyme Inhibition Constant Data from BindingDB
Found 1 hit for monomerid = 35892
TargetAndrogen receptor(Homo sapiens (Human))
St. Jude Research Hospital
LigandPNGBDBM35892(flufenamic acid analogue, 19)
Affinity DataIC50:  5.60E+3nM EC50:  2.80E+4nMpH: 7.2 T: 2°C. Assay description: A radiolabeled ligand competition scintillation proximity assay (SPA) for the androgen receptor (AR) using Ni-coated 384-well FlashPlates. It measure...
In DepthDetails ArticlePubMed