BDBM35919 flufenamic acid analogue, 45
SMILES OC(=O)c1ccccc1Nc1ccccc1-c1ccccc1
InChI Key InChIKey=YKXRPQKGOAZEFQ-UHFFFAOYSA-N
Data  3 KI  1 Kd  1 EC50
PDB links: 1 PDB ID matches this monomer.
  Tab Delimited (TSV)   2D SDfile   Computed 3D by Vconf -m prep SDfile
Find this compound or compounds like it in BindingDB:
Activity Spreadsheet -- Enzyme Inhibition Constant Data from BindingDB
Found 5 hits for monomerid = 35919
TargetFatty acid-binding protein, adipocyte(Homo sapiens (Human))
Chinese Academy Of Sciences
Curated by ChEMBL
LigandPNGBDBM35919(flufenamic acid analogue, 45)
Affinity DataKi:  109nM. Assay description: Displacement of 1,8-ANS from recombinant human 6His-tagged FABP4 expressed in Escherichia coli BL21 DE3 incubated for 15 mins followed by 1,8-ANS add...
TargetFatty acid-binding protein 5(Homo sapiens (Human))
Chinese Academy Of Sciences
Curated by ChEMBL
LigandPNGBDBM35919(flufenamic acid analogue, 45)
Affinity DataKi:  8.23E+3nM. Assay description: Displacement of 1,8-ANS from recombinant human 6His-tagged FABP5 expressed in Escherichia coli BL21 DE3 incubated for 15 mins followed by 1,8-ANS add...
In DepthDetails ArticlePubMed
TargetFatty acid-binding protein, heart(Homo sapiens (Human))
Chinese Academy Of Sciences
Curated by ChEMBL
LigandPNGBDBM35919(flufenamic acid analogue, 45)
Affinity DataKi:  1.28E+4nM. Assay description: Displacement of 1,8-ANS from recombinant human 6His-tagged FABP3 expressed in Escherichia coli BL21 DE3 incubated for 15 mins followed by 1,8-ANS add...
In DepthDetails ArticlePubMed
TargetAndrogen receptor(Homo sapiens (Human))
St. Jude Research Hospital
LigandPNGBDBM35919(flufenamic acid analogue, 45)
Affinity DataEC50:  9.30E+4nM. Assay description: AR functionality was determined by fluorescence polarization (excitation @485 nm, emission @ 530 nm) assay, which measures fluorescently labeled SRC2...
In DepthDetails ArticlePubMed
TargetFatty acid-binding protein, adipocyte(Homo sapiens (Human))
Chinese Academy Of Sciences
Curated by ChEMBL
LigandPNGBDBM35919(flufenamic acid analogue, 45)
Affinity DataKd:  111nM. Assay description: Binding affinity at recombinant human 6His-tagged FABP4 expressed in Escherichia coli BL21 DE3 by isothermal titration calorimetry