BDBM360291 (R)-(1-ethylpyrrolidin-3-yl)methyl (3'-chloro-4',5-difluoro-[1,1'-biphenyl]-2-yl)carbamate::US9828339, Example 196
SMILES CCN1CC[C@@H](COC(=O)Nc2ccc(F)cc2-c2ccc(F)c(Cl)c2)C1
InChI Key InChIKey=FYBHGCHUUOKINK-CYBMUJFWSA-N
Data  1 KI
  Tab Delimited (TSV)   2D SDfile   Computed 3D by Vconf -m prep SDfile
Find this compound or compounds like it in BindingDB:
Activity Spreadsheet -- Enzyme Inhibition Constant Data from BindingDB
Found 1 hit for monomerid = 360291
TargetMuscarinic acetylcholine receptor M3(Homo sapiens (Human))
Dong-A St
US Patent
LigandPNGBDBM360291((R)-(1-ethylpyrrolidin-3-yl)methyl (3'-chloro-4',5...)
Affinity DataKi:  7.67nM. Assay description: Cell membrane proteins (Perkin Elmer) wherein human muscarinic M3 receptor was overexpressed, [3H]-methyl scopolamine and test compounds in various c...
Ligand InfoPC cidPC sid
In DepthDetails US Patent