BDBM360442 US9828369, Example 14::ethyl 3-(8-((2- phenylcyclopropanecarboxamido) methyl)isoquinolin-5-yl)benzoate
SMILES CCOC(=O)c1cccc(c1)-c1ccc(CNC(=O)C2CC2c2ccccc2)c2cnccc12
InChI Key InChIKey=JXMCEIXOVNCUBD-UHFFFAOYSA-N
Data  1 IC50
  Tab Delimited (TSV)   2D SDfile   Computed 3D by Vconf -m prep SDfile
Find this compound or compounds like it in BindingDB:
Activity Spreadsheet -- Enzyme Inhibition Constant Data from BindingDB
Found 1 hit for monomerid = 360442
TargetDiacylglycerol O-acyltransferase 2(Homo sapiens (Human))
Merck Sharpe & Dohme
US Patent
LigandPNGBDBM360442(US9828369, Example 14 | ethyl 3-(8-((2- phenylcycl...)
Affinity DataIC50:  71nM. Assay description: DGAT2 activity was determined by measuring the amount of enzymatic product triolein (1,2,3-Tri(cis-9-octadecenoyl)glycerol) using the membrane prep m...
Ligand InfoPC cidPC sid
In DepthDetails US Patent