BDBM363101 US9850225, Example 1034::methyl 3-((2-(((2-acetamidoethyl)amino)methyl)-5-((2-methyl-[1,1′-biphenyl]-3-yl)methoxy)phenoxy)methyl)benzoate
SMILES COC(=O)c1cccc(COc2cc(OCc3cccc(c3C)-c3ccccc3)ccc2CNCCNC(C)=O)c1
InChI Key InChIKey=SXGOPXLZKCGDDB-UHFFFAOYSA-N
Data  1 IC50
  Tab Delimited (TSV)   2D SDfile   Computed 3D by Vconf -m prep SDfile
Find this compound or compounds like it in BindingDB:
Activity Spreadsheet -- Enzyme Inhibition Constant Data from BindingDB
Found 1 hit for monomerid = 363101
TargetProgrammed cell death 1 ligand 1(Homo sapiens (Human))
Bristol-Myers Squibb
US Patent
LigandPNGBDBM363101(US9850225, Example 1034 | methyl 3-((2-(((2-acetam...)
Affinity DataIC50:  1.01E+4nM. Assay description: The interaction of PD-1 and PD-L1 can be assessed using soluble, purified preparations of the extracellular domains of the two proteins. The PD-1 and...
Ligand InfoPC cidPC sid
In DepthDetails US Patent