BDBM365804 (2R,4R)-4-methyl-1-({3-methyl- 4-[(2-methyl-3-phenylphenyl) methoxy]phenyl}methyl) pyrrolidine-2-carboxylic acid::US9872852, Example 56
SMILES C[C@@H]1C[C@@H](N(Cc2ccc(OCc3cccc(c3C)-c3ccccc3)c(C)c2)C1)C(O)=O
InChI Key InChIKey=WJLRWTHTEIJWTE-NIYFSFCBSA-N
Data  1 IC50
  Tab Delimited (TSV)   2D SDfile   Computed 3D by Vconf -m prep SDfile
Find this compound or compounds like it in BindingDB:
Activity Spreadsheet -- Enzyme Inhibition Constant Data from BindingDB
Found 1 hit for monomerid = 365804
TargetProgrammed cell death 1 ligand 1(Homo sapiens (Human))
Bristol-Myers Squibb
US Patent
LigandPNGBDBM365804((2R,4R)-4-methyl-1-({3-methyl- 4-[(2-methyl-3-phen...)
Affinity DataIC50:  555nM. Assay description: All binding studies were performed in an HTRF assay buffer consisting of dPBS supplemented with 0.1% (withv) bovine serum albumin and 0.05% (v/v) Twe...
Ligand InfoPC cidPC sid
In DepthDetails US Patent