BDBM37003 (2-ethoxyphenyl)methyl 3-(1,2,3,4-tetrazol-1-yl)benzoate::(2-ethoxyphenyl)methyl 3-(tetrazol-1-yl)benzoate::3-(1-tetrazolyl)benzoic acid (2-ethoxyphenyl)methyl ester::3-(tetrazol-1-yl)benzoic acid (2-ethoxybenzyl) ester::MLS000057714::SMR000068633::cid_2567904
SMILES CCOc1ccccc1COC(=O)c1cccc(c1)-n1cnnn1
InChI Key InChIKey=VFXUMXFXIIIBLO-UHFFFAOYSA-N
Data  3 EC50
  Tab Delimited (TSV)   2D SDfile   Computed 3D by Vconf -m prep SDfile
Find this compound or compounds like it in BindingDB:
Activity Spreadsheet -- Enzyme Inhibition Constant Data from BindingDB
Found 3 hits for monomerid = 37003
TargetSphingosine 1-phosphate receptor 1(Homo sapiens (Human))
The Scripps Research Institute Molecular Screening Center
Curated by PubChem BioAssay
LigandPNGBDBM37003((2-ethoxyphenyl)methyl 3-(1,2,3,4-tetrazol-1-yl)be...)
Affinity DataEC50:  2.58E+4nM. Assay description: Source (MLSCN Center Name): The Scripps Research Institute Molecular Screening Center Center Affiliation: The Scripps Research Institute, TSRI Assay ...
In DepthDetails PCBioAssay
TargetSphingosine 1-phosphate receptor 1(Homo sapiens (Human))
The Scripps Research Institute Molecular Screening Center
Curated by PubChem BioAssay
LigandPNGBDBM37003((2-ethoxyphenyl)methyl 3-(1,2,3,4-tetrazol-1-yl)be...)
Affinity DataEC50:  2.29E+4nM. Assay description: Source (MLSCN Center Name): The Scripps Research Institute Molecular Screening Center Center Affiliation: The Scripps Research Institute, TSRI Assay ...
In DepthDetails PCBioAssay
TargetSphingosine 1-phosphate receptor 1(Homo sapiens (Human))
The Scripps Research Institute Molecular Screening Center
Curated by PubChem BioAssay
LigandPNGBDBM37003((2-ethoxyphenyl)methyl 3-(1,2,3,4-tetrazol-1-yl)be...)
Affinity DataEC50: >9.51E+4nM. Assay description: Source (MLSCN Center Name): The Scripps Research Institute Molecular Screening Center Center Affiliation: The Scripps Research Institute, TSRI Assay ...
In DepthDetails PCBioAssay