BDBM373268 (3S,5S)-1-([1,1′-biphenyl]-2-carbonyl)-5-((quinoline-8-carboxamido)methyl)pyrrolidin-3-yl acetate::US9896452, Example 131
SMILES CC(=O)O[C@H]1C[C@@H](CNC(=O)c2cccc3cccnc23)N(C1)C(=O)c1ccccc1-c1ccccc1
InChI Key InChIKey=UNSBHHWFPLXPNB-ZEQRLZLVSA-N
Data  2 IC50
  Tab Delimited (TSV)   2D SDfile   Computed 3D by Vconf -m prep SDfile
Find this compound or compounds like it in BindingDB:
Activity Spreadsheet -- Enzyme Inhibition Constant Data from BindingDB
Found 2 hits for monomerid = 373268
TargetOrexin receptor type 2(Homo sapiens (Human))
Eolas Therapeutics
US Patent
LigandPNGBDBM373268((3S,5S)-1-([1,1′-biphenyl]-2-carbonyl)-5-((q...)
Affinity DataIC50:  40nM. Assay description: Measurement of [Ca2+]i using a FLIPR: CHO-OX1 or CHO-OX2 cells are seeded into black-walled clear-base 384-well plates (Costar) at a density of 20,00...
Ligand InfoPC cidPC sid
In DepthDetails US Patent
TargetOrexin/Hypocretin receptor type 1(Homo sapiens (Human))
Eolas Therapeutics
US Patent
LigandPNGBDBM373268((3S,5S)-1-([1,1′-biphenyl]-2-carbonyl)-5-((q...)
Affinity DataIC50:  53nM. Assay description: Measurement of [Ca2+]i using a FLIPR: CHO-OX1 or CHO-OX2 cells are seeded into black-walled clear-base 384-well plates (Costar) at a density of 20,00...
Ligand InfoPC cidPC sid
In DepthDetails US Patent