BDBM376415 US9914740, IX-4::methyl 3-((6H- isochromeno[4,3-d] pyrimidine-8- carboxamido) methyl)benzoate
SMILES COC(=O)c1cccc(CNC(=O)c2ccc-3c(COc4cncnc-34)c2)c1
InChI Key InChIKey=FCAUANGVXFDGTL-UHFFFAOYSA-N
Data  1 IC50
  Tab Delimited (TSV)   2D SDfile   Computed 3D by Vconf -m prep SDfile
Find this compound or compounds like it in BindingDB:
Activity Spreadsheet -- Enzyme Inhibition Constant Data from BindingDB
Found 1 hit for monomerid = 376415
TargetRho-associated protein kinase 2(Homo sapiens (Human))
Bristol-Myers Squibb
US Patent
LigandPNGBDBM376415(US9914740, IX-4 | methyl 3-((6H- isochromeno[4,3-d...)
Affinity DataIC50:  20.9nM. Assay description: The effectiveness of compounds of the present invention as ROCK inhibitors can be determined in a 30 μL assay containing 20 mM HEPES, pH 7.5, 20...
Ligand InfoPC cidPC sid
In DepthDetails US Patent