BDBM38207 US10093650, Example 9::US10329273, Example 9::US11479538, Example 9
SMILES CCn1ccc(n1)C1=C(C(=O)N[C@@](C1)(c1ccc(OCCCC(F)(F)F)cc1F)C(F)(F)F)n1nn[nH]c1=O
InChI Key InChIKey=HUTKPNIRZDSCFI-UHFFFAOYSA-N
Data  3 IC50
  Tab Delimited (TSV)   2D SDfile   Computed 3D by Vconf -m prep SDfile
Find this compound or compounds like it in BindingDB:
Activity Spreadsheet -- Enzyme Inhibition Constant Data from BindingDB
Found 3 hits for monomerid = 38207
TargetAlpha-1,6-mannosyl-glycoprotein 2-beta-N-acetylglucosaminyltransferase(Homo sapiens (Human))
Bristol-Myers Squibb
US Patent
LigandPNGBDBM38207(US10093650, Example 9 | US10329273, Example 9 | US...)
Affinity DataIC50:  108nMpH: 7.4Assay Description:The MGAT enzyme reactions were performed in Corning FALCONŽ 96-well polypropylene plates, in a total volume of 60 μL of 50 mM potassium phosphat...
In DepthDetails US Patent
Target2-acylglycerol O-acyltransferase 2(Homo sapiens (Human))
Bristol-Myers Squibb
US Patent
LigandPNGBDBM38207(US10093650, Example 9 | US10329273, Example 9 | US...)
Affinity DataIC50:  108nM. Assay description: The MGAT enzyme reactions were performed in Corning FALCONŽ 96-well polypropylene plates, in a total volume of 60 μL of 50 mM potassium phosphat...
In DepthDetails US Patent
TargetAlpha-1,6-mannosyl-glycoprotein 2-beta-N-acetylglucosaminyltransferase(Homo sapiens (Human))
Bristol-Myers Squibb
US Patent
LigandPNGBDBM38207(US10093650, Example 9 | US10329273, Example 9 | US...)
Affinity DataIC50:  108nM. Assay description: The MGAT enzyme reactions were performed in Corning FALCONŽ 96-well polypropylene plates, in a total volume of 60 μL of 50 mM potassium phosphat...
In DepthDetails US Patent