BDBM38628 MLS000059146::N-methyl-N-(4-methylbenzyl)-2-(2-pyridinyl)ethanamine::N-methyl-N-[(4-methylphenyl)methyl]-2-(2-pyridinyl)ethanamine::N-methyl-N-[(4-methylphenyl)methyl]-2-pyridin-2-yl-ethanamine::N-methyl-N-[(4-methylphenyl)methyl]-2-pyridin-2-ylethanamine::SMR000069517::cid_768447::methyl-(4-methylbenzyl)-[2-(2-pyridyl)ethyl]amine
SMILES CN(CCc1ccccn1)Cc1ccc(C)cc1
InChI Key InChIKey=WBEJJOSWBLYDBQ-UHFFFAOYSA-N
Data  3 IC50
  Tab Delimited (TSV)   2D SDfile   Computed 3D by Vconf -m prep SDfile
Find this compound or compounds like it in BindingDB:
Activity Spreadsheet -- Enzyme Inhibition Constant Data from BindingDB
Found 3 hits for monomerid = 38628
TargetMevalonate kinase(Streptococcus pneumoniae D39)
Srmlsc
Curated by PubChem BioAssay
LigandPNGBDBM38628(MLS000059146 | N-methyl-N-(4-methylbenzyl)-2-(2-py...)
Affinity DataIC50:  1.65E+5nM. Assay description: Southern Research Molecular Libraries Screening Center (SRMLSC) Southern Research Institute (Birmingham, Alabama) NIH Molecular Libraries Screening C...
In DepthDetails PCBioAssay
TargetMevalonate kinase(Streptococcus pneumoniae D39)
Srmlsc
Curated by PubChem BioAssay
LigandPNGBDBM38628(MLS000059146 | N-methyl-N-(4-methylbenzyl)-2-(2-py...)
Affinity DataIC50:  4.67E+5nM. Assay description: Southern Research Molecular Libraries Screening Center (SRMLSC) Southern Research Institute (Birmingham, Alabama) NIH Molecular Libraries Screening C...
In DepthDetails PCBioAssay
TargetMevalonate kinase(Streptococcus pneumoniae D39)
Srmlsc
Curated by PubChem BioAssay
LigandPNGBDBM38628(MLS000059146 | N-methyl-N-(4-methylbenzyl)-2-(2-py...)
Affinity DataIC50: >1.00E+7nM. Assay description: Southern Research Molecular Libraries Screening Center (SRMLSC) Southern Research Institute (Birmingham, Alabama) NIH Molecular Libraries Screening C...
In DepthDetails PCBioAssay