BDBM387563 Ethyl (3- chloro-4- fluorophenyl) (2-((ethoxy- carbonyl) amino)-7- iodofuro[2,3- c]pyridin-3- yl)carbamate::US10294212, No. 156
SMILES CCOC(=O)Nc1oc2c(I)nccc2c1N(C(=O)OCC)c1ccc(F)c(Cl)c1
InChI Key InChIKey=ICEKCCODTUNTDT-UHFFFAOYSA-N
Data  1 IC50
  Tab Delimited (TSV)   2D SDfile   Computed 3D by Vconf -m prep SDfile
Find this compound or compounds like it in BindingDB:
Activity Spreadsheet -- Enzyme Inhibition Constant Data from BindingDB
Found 1 hit for monomerid = 387563
TargetIndoleamine 2,3-dioxygenase 1(Homo sapiens (Human))
Curadev Pharma
US Patent
LigandPNGBDBM387563(Ethyl (3- chloro-4- fluorophenyl) (2-((ethoxy- car...)
Affinity DataIC50: >1.00E+3nM. Assay description: Human indoleamine 2,3-dioxygenasel (hIDO1) catalyzes the oxidative cleavage of the pyrrole ring of the indole nucleus of tryptophan to yield N-formyl...
Ligand InfoPC cidPC sid
In DepthDetails US Patent