BDBM387564 Ethyl (7-(4- carbamoyl- phenyl)-3-((3- chloro-4- fluorophenyl) amino)furo[2,3- c]pyridin-2- yl)carbamate::US10294212, No. 157
SMILES CCOC(=O)Nc1oc2c(nccc2c1Nc1ccc(F)c(Cl)c1)-c1ccc(cc1)C(N)=O
InChI Key InChIKey=OGFNJFVMUUYRQH-UHFFFAOYSA-N
Data  1 IC50
  Tab Delimited (TSV)   2D SDfile   Computed 3D by Vconf -m prep SDfile
Find this compound or compounds like it in BindingDB:
Activity Spreadsheet -- Enzyme Inhibition Constant Data from BindingDB
Found 1 hit for monomerid = 387564
TargetIndoleamine 2,3-dioxygenase 1(Homo sapiens (Human))
Curadev Pharma
US Patent
LigandPNGBDBM387564(Ethyl (7-(4- carbamoyl- phenyl)-3-((3- chloro-4- f...)
Affinity DataIC50: >1.00E+3nM. Assay description: Human indoleamine 2,3-dioxygenasel (hIDO1) catalyzes the oxidative cleavage of the pyrrole ring of the indole nucleus of tryptophan to yield N-formyl...
Ligand InfoPC cidPC sid
In DepthDetails US Patent