BDBM387626 Ethyl (3-((3- chloro-4- fluorophenyl) amino)benzo [b]thiophen-2- yl)carbamate::US10294212, No. 209
SMILES CCOC(=O)Nc1sc2ccccc2c1Nc1ccc(F)c(Cl)c1
InChI Key InChIKey=XLQFBIPTVNETRD-UHFFFAOYSA-N
Data  1 IC50
  Tab Delimited (TSV)   2D SDfile   Computed 3D by Vconf -m prep SDfile
Find this compound or compounds like it in BindingDB:
Activity Spreadsheet -- Enzyme Inhibition Constant Data from BindingDB
Found 1 hit for monomerid = 387626
TargetIndoleamine 2,3-dioxygenase 1(Homo sapiens (Human))
Curadev Pharma
US Patent
LigandPNGBDBM387626(Ethyl (3-((3- chloro-4- fluorophenyl) amino)benzo ...)
Affinity DataIC50: >1.00E+3nM. Assay description: Human indoleamine 2,3-dioxygenasel (hIDO1) catalyzes the oxidative cleavage of the pyrrole ring of the indole nucleus of tryptophan to yield N-formyl...
Ligand InfoPC cidPC sid
In DepthDetails US Patent