BDBM390429 US10442772, Example 2-8::US9957235, 2-8::tert-butyl{[1-(3,3,5,5-tetramethylcyclohexyl)-2-{[4-(trifluoromethoxy)phenyl]-amino}-1H-benzimidazol-5-yl]oxy}acetate
SMILES CC(C)(C)OC(=O)COc1ccc2n(C3CC(C)(C)CC(C)(C)C3)c(Nc3ccc(OC(F)(F)F)cc3)nc2c1
InChI Key InChIKey=OOKABEGLDRDGKT-UHFFFAOYSA-N
Data  2 IC50
  Tab Delimited (TSV)   2D SDfile   Computed 3D by Vconf -m prep SDfile
Find this compound or compounds like it in BindingDB:
Activity Spreadsheet -- Enzyme Inhibition Constant Data from BindingDB
Found 2 hits for monomerid = 390429
TargetIsocitrate dehydrogenase [NADP] cytoplasmic [R132H](Homo sapiens (Human))
Bayer Pharma Aktiengesellschaft
US Patent
LigandPNGBDBM390429(US10442772, Example 2-8 | US9957235, 2-8 | tert-bu...)
Affinity DataIC50:  410nM. Assay description: The biochemical reactions were performed at 32° C. in 384-well plates using a reaction volume of 41 μL and the following assay buffer conditions...
Ligand InfoPC cidPC sid
In DepthDetails US Patent
TargetIsocitrate dehydrogenase [NADP] cytoplasmic [R132H](Homo sapiens (Human))
Bayer Pharma Aktiengesellschaft
US Patent
LigandPNGBDBM390429(US10442772, Example 2-8 | US9957235, 2-8 | tert-bu...)
Affinity DataIC50:  410nM. Assay description: mIDH1 catalyzes the NADPH-dependent reduction of alpha-ketoglutarate (α-KG) to (2R)-2-hydroxyglutarate (2-HG). NADPH consumption was measured by...
Ligand InfoPC cidPC sid
In DepthDetails US Patent