BDBM393615 US09969700, 173
SMILES Clc1ccccc1CS(=O)(=O)Nc1ccc(cc1)N1c2ccc3ccccc3c2NC(=O)CC1=O
InChI Key InChIKey=ONPKYJZBKMORKR-UHFFFAOYSA-N
Data  3 IC50
  Tab Delimited (TSV)   2D SDfile   Computed 3D by Vconf -m prep SDfile
Find this compound or compounds like it in BindingDB:
Activity Spreadsheet -- Enzyme Inhibition Constant Data from BindingDB
Found 3 hits for monomerid = 393615
TargetP2X purinoceptor 4(Homo sapiens (Human))
Nippon Chemiphar
US Patent
LigandPNGBDBM393615(US09969700, 173)
Affinity DataIC50:  64nM. Assay description: The P2X4 receptor antagonist activity of the compounds of the present invention was measured as follows. The 1321N1 cells stably expressing human P2X...
Ligand InfoPC cidPC sid
In DepthDetails US Patent
TargetP2X purinoceptor 4(Homo sapiens (Human))
Nippon Chemiphar
US Patent
LigandPNGBDBM393615(US09969700, 173)
Affinity DataIC50:  64nM. Assay description: Antagonist activity at human P2X4 receptor tranfected in human 1321N1 cells assessed as inhibition of ATP-induced calcium influx incubated for 15 min...
Ligand InfoPC cidPC sid
In DepthDetails ArticlePubMed
TargetP2X purinoceptor 4(Homo sapiens (Human))
Nippon Chemiphar
US Patent
LigandPNGBDBM393615(US09969700, 173)
Affinity DataIC50:  54nM. Assay description: Antagonist activity at human P2X4 receptor expressed in HEK cells assessed as reduction in ATP induced calcium influx
Ligand InfoPC cidPC sid
In DepthDetails ArticlePubMed