BDBM3958 2-thioxo-1H-indole-3-alkanoic acid deriv. 7::Methyl 2,3-Dihydro-2-thioxo-1H-indole-3-acetate::methyl 2-(2-sulfanylidene-2,3-dihydro-1H-indol-3-yl)acetate
SMILES COC(=O)CC1C(=S)Nc2ccccc12
InChI Key InChIKey=HSUWGLPKYSSVBN-UHFFFAOYSA-N
Data  1 IC50
  Tab Delimited (TSV)   2D SDfile   Computed 3D by Vconf -m prep SDfile
Find this compound or compounds like it in BindingDB:
Activity Spreadsheet -- Enzyme Inhibition Constant Data from BindingDB
Found 1 hit for monomerid = 3958
TargetEpidermal growth factor receptor(Homo sapiens (Human))
University Of Auckland
LigandPNGBDBM3958(2-thioxo-1H-indole-3-alkanoic acid deriv. 7 | Meth...)
Affinity DataIC50:  1.00E+5nMpH: 7.4 T: 2°C. Assay description: IC50 is the inhibitor concentration which inhibits 50% of kinase activity that catalyzes the transfer of the terminal phosphate from [gamma-32P] labe...
In DepthDetails ArticlePubMed