BDBM39667 2-[4-(4-fluorobenzoyl)phenyl]-2-phenyl-acetonitrile::2-[4-(4-fluorobenzoyl)phenyl]-2-phenylacetonitrile::2-[4-(4-fluorophenyl)carbonylphenyl]-2-phenyl-ethanenitrile::2-[4-[(4-fluorophenyl)-oxomethyl]phenyl]-2-phenylacetonitrile::MLS000539974::SMR000125432::cid_2774429
SMILES Fc1ccc(cc1)C(=O)c1ccc(cc1)C(C#N)c1ccccc1
InChI Key InChIKey=QJMRRCCYVJFYLS-UHFFFAOYSA-N
Data  1 IC50  1 EC50
  Tab Delimited (TSV)   2D SDfile   Computed 3D by Vconf -m prep SDfile
Find this compound or compounds like it in BindingDB:
Activity Spreadsheet -- Enzyme Inhibition Constant Data from BindingDB
Found 2 hits for monomerid = 39667
TargetAlkaline phosphatase, germ cell type(Homo sapiens (Human))
Burnham Center For Chemical Genomics
Curated by PubChem BioAssay
LigandPNGBDBM39667(2-[4-(4-fluorobenzoyl)phenyl]-2-phenyl-acetonitril...)
Affinity DataEC50:  9.99E+5nM. Assay description: Sanford-Burnham Center for Chemical Genomics (SBCCG) Sanford-Burnham Medical Research Institute (SBMRI, San Diego, CA) NIH Molecular Libraries Screen...
In DepthDetails PCBioAssay
TargetAlkaline phosphatase, germ cell type(Homo sapiens (Human))
Burnham Center For Chemical Genomics
Curated by PubChem BioAssay
LigandPNGBDBM39667(2-[4-(4-fluorobenzoyl)phenyl]-2-phenyl-acetonitril...)
Affinity DataIC50:  9.99E+5nM. Assay description: Sanford-Burnham Center for Chemical Genomics (SBCCG) Sanford-Burnham Medical Research Institute (SBMRI, San Diego, CA) NIH Molecular Libraries Screen...
In DepthDetails PCBioAssay