BDBM405561 US10351547, Compound 1-9::US10597377, Compound 1-9
SMILES Cc1cc(F)cc(c1)-c1nnc2cc(Cl)c(cc2c1N1CCC(N)CC1)-c1cccc2[nH]c(=O)[nH]c12
InChI Key InChIKey=ZPRAZTFNYOIBHS-UHFFFAOYSA-N
Data  2 EC50
  Tab Delimited (TSV)   2D SDfile   Computed 3D by Vconf -m prep SDfile
Find this compound or compounds like it in BindingDB:
Activity Spreadsheet -- Enzyme Inhibition Constant Data from BindingDB
Found 2 hits for monomerid = 405561
TargetSomatostatin receptor type 2(Homo sapiens (Human))
Crinetics Pharmaceuticals
US Patent
LigandPNGBDBM405561(US10351547, Compound 1-9 | US10597377, Compound 1-...)
Affinity DataEC50:  55nM. Assay description: Four days prior to the assay, 5,000 Chinese hamster ovary cells (CHO-K1, ATCC # CCL-61) stably expressing the human SSTR2 are plated in each well of ...
Ligand InfoPC cidPC sid
In DepthDetails US Patent
TargetSomatostatin receptor type 2(Homo sapiens (Human))
Crinetics Pharmaceuticals
US Patent
LigandPNGBDBM405561(US10351547, Compound 1-9 | US10597377, Compound 1-...)
Affinity DataEC50:  55nM. Assay description: Four days prior to the assay, 5,000 Chinese hamster ovary cells (CHO-K1, ATCC #CCL-61) stably expressing the human SSTR2 are plated in each well of a...
Ligand InfoPC cidPC sid
In DepthDetails US Patent